{"text_format":"1","workbook":"xlsx","n_sheets":4,"sheets":["Sector Interactive","Economy Interactive","Calculation","Data"],"not_rendered":{"charts":4,"images":0,"macros":1,"external_links":0,"defined_names":0,"comments":0,"pivot_tables":0},"unopened":[],"bounds":{"document_bytes":16777216,"sheet_cells":100000,"rows_first":2000,"rows_last":500,"rows_between":2000,"halvings":0,"cell_chars":16384,"cell_head_chars":4096},"cells_cut":0,"cells_raw":0,"read":"whole","date_system":"1900"}

{"sheet":"Sector Interactive","index":0,"n_rows":15,"n_cols":16,"rows_kept":15,"cut":false,"hidden":false,"merged":[]}
[null,null,null,null,null,null,null,null,null,null,null,null,"Employment Sector"]
[null,null,null,null,null,null,null,null,null,null,null,null,3,{"$f":"INDEX(Data!A8:A21,'Sector Interactive'!M2)","v":"Tourism"}]
[]
[]
[]
[null,null,null,null,null,null,null,null,null,null,null,null,"Living Wage ",null,"Nonlabour Cost "]
[null,null,null,null,null,null,null,null,null,null,null,null,"Increment",null,"Fixed Share"]
[null,null,null,null,null,null,null,null,null,null,null,null,3,{"$f":"INDEX(Calculation!X1:X5,'Sector Interactive'!M8)","v":5.375},3,{"$f":"INDEX(Calculation!AB1:AB5,'Sector Interactive'!O8)","v":0.5}]
[]
[]
[]
[null,null,null,null,null,null,null,null,null,null,null,null,"Price","Quantity","FC","VC"]
[null,null,null,null,null,null,null,null,null,null,null,null,"Scale","Scale","Scale","Scale"]
[null,null,null,null,null,null,null,null,null,null,null,null,{"$f":"200-M15","v":100},{"$f":"200-N15","v":100},{"$f":"200-O15","v":100},{"$f":"200-P15","v":100}]
[null,null,null,null,null,null,null,null,null,null,null,null,100,100,100,100]

{"sheet":"Economy Interactive","index":1,"n_rows":9,"n_cols":13,"rows_kept":9,"cut":false,"hidden":false,"merged":[]}
[null,null,null,null,null,null,null,null,null,null,null,null,"Economy Wide Multiplier"]
[null,null,null,null,null,null,null,null,null,null,null,null,3]
[]
[]
[]
[]
[]
[null,null,null,null,null,null,null,null,null,null,null,null,"Sales Volume Multiplier Share"]
[null,null,null,null,null,null,null,null,null,null,null,null,2]

{"sheet":"Calculation","index":2,"n_rows":129,"n_cols":76,"rows_kept":129,"cut":false,"hidden":false,"merged":[]}
[null,null,null,null,null,null,null,null,null,null,null,null,null,null,null,null,null,null,null,null,null,"Living Wage Increment",null,{"$f":"X3/2","v":2.6875},null,"Nonlabour Cost Fixed Share",null,0,null,"Multiplier",null,1,null,"Multiplier Quantity Share",null,null,0]
[null,null,null,null,null,null,null,null,null,null,null,null,null,null,null,null,null,null,null,null,null,null,{"$f":"'Sector Interactive'!N8","v":5.375},{"$f":"(X3+X1)/2","v":4.03125},null,null,{"$f":"'Sector Interactive'!P8","v":0.5},0.25,null,null,{"$f":"INDEX(AF1:AF6,'Economy Interactive'!M2)","v":1.02},1.01,null,null,null,{"$f":"INDEX(AK1:AK5,'Economy Interactive'!M9)","v":0.25},0.25]
[null,null,null,null,null,null,null,null,null,null,null,null,null,null,null,null,null,null,null,null,null,null,null,{"$f":"Data!$F$4-Data!$E$4","v":5.375},null,null,null,0.5,null,null,null,1.02,null,null,null,null,0.5]
[null,null,null,null,null,null,null,null,null,null,null,null,null,null,null,null,null,null,null,null,null,null,null,{"$f":"(X5+X3)/2","v":6.5625},null,null,null,0.75,null,null,null,1.03,null,null,null,null,0.75]
[null,null,null,null,null,null,null,null,null,null,null,null,null,null,null,null,null,null,null,null,null,null,null,{"$f":"Data!$F$4-Data!$E$2","v":7.75},null,null,null,1,null,null,null,1.04,null,null,null,null,1,null,null,null,null,null,null,"Price Adjustment",null,null,null,null,null,{"$f":"'Sector Interactive'!M14/100","v":1}]
[null,null,null,null,null,null,null,null,null,null,null,null,null,null,null,null,null,null,null,null,null,null,null,null,null,null,null,null,null,null,null,1.05,null,null,"Simplified Example",null,null,null,null,null,null,null,null,"Quantity Adjustment",null,null,null,null,null,{"$f":"'Sector Interactive'!N14/100","v":1},null,null,null,null,null,null,"Row index",null,{"$f":"'Sector Interactive'!$M$2","v":3}]
[null,null,null,null,null,null,null,null,null,null,null,null,null,null,null,null,null,null,null,null,null,null,null,null,null,null,null,null,null,null,null,null,null,null,null,null,null,null,null,null,null,null,null,"FC Adjustment",null,null,null,null,null,{"$f":"'Sector Interactive'!O14/100","v":1}]
[null,null,null,null,null,null,null,null,null,null,null,null,null,null,null,null,null,null,null,null,null,null,null,null,null,null,null,null,null,null,null,null,null,null,null,null,null,null,null,null,null,null,null,"VC Adjustment",null,null,null,null,null,{"$f":"'Sector Interactive'!P14/100","v":1}]
[null,null,null,null,null,null,null,null,null,null,null,null,null,null,null,null,null,null,null,null,null,null,null,null,null,null,null,"Variable","Variable",null,"Addtl Rev","Additional","Revenue",null,"Revenue and Cost without Living Wage",null,null,null,null,null,null,null,null,"Revenue and Cost with Living Wage"]
[null,null,null,null,null,null,null,null,null,null,null,null,null,null,null,null,null,"Expenses",null,null,null,"Living","Additional",null,null,null,null,"Cost","Cost",null,"Retained","Revenue","Growth",null,null,"Costs",null,null,null,null,null,"Living",null,null,null,null,"Costs","Average",null,null,null,null,null,null,null,null,"Graphing information"]
[null,"Employment by Wage Category",null,null,null,null,null,null,"Wage Bill by Wage Category",null,null,null,null,null,null,"Sector","Sector","Net",null,"Profit",null,"Wage","Wage",null,"Profit",null,"Fixed ","Net","Revenue",null,"Net","to Restore","to Restore",null,null,"Net","Fixed","Variable","Labour",null,null,"Wage",null,null,null,null,"Net","Variable","Fixed","Variable","Labour"]
["Sector",{"$f":"Data!E7","v":"$10.25-15.00"},{"$f":"Data!F7","v":"$16.00-20.00"},{"$f":"Data!G7","v":"$21.00-25.00"},{"$f":"Data!H7","v":"$26.00-30.00"},{"$f":"Data!I7","v":"$30.00-50.00"},"Total",null,{"$f":"Data!E7","v":"$10.25-15.00"},{"$f":"Data!F7","v":"$16.00-20.00"},{"$f":"Data!G7","v":"$21.00-25.00"},{"$f":"Data!H7","v":"$26.00-30.00"},{"$f":"Data!I7","v":"$30.00-50.00"},"Total",null,"Revenue","Expenses","Labour","Profit","Share",null,"Employees","Costs","Profit","Share",null,"Cost","Labour","Share",null,"Labour","Profit","Profit",null,"Revenue","Labour","Costs","Cost","Cost","Profit",null,"Increment",null,"Revenue","Price","Quantity","Labour","Cost","Costs","Cost","Cost","Profit",null,null,null,null,"Revenue","FC","VC","Labour","Profit"]
[{"$f":"Data!A8","v":"Forestry"},{"$f":"Data!$C8*Data!E8/100","v":105.6},{"$f":"Data!$C8*Data!F8/100","v":233.28},{"$f":"Data!$C8*Data!G8/100","v":122.88},{"$f":"Data!$C8*Data!H8/100","v":87.36},{"$f":"Data!$C8*Data!I8/100","v":410.88},{"$f":"Data!$C8*Data!J8/100","v":960},null,{"$f":"B13*Data!E$4*Data!$B$3*Data!$B$4","v":2333099.9999999995},{"$f":"C13*Data!F$4*Data!$B$3*Data!$B$4","v":7348320},{"$f":"D13*Data!G$4*Data!$B$3*Data!$B$4","v":4945920},{"$f":"E13*Data!H$4*Data!$B$3*Data!$B$4","v":4280640},{"$f":"F13*Data!I$4*Data!$B$3*Data!$B$4","v":28761600},{"$f":"SUM(I13:M13)","v":47669580},null,{"$f":"N13/Data!G29*100","v":203716148.8646442},{"$f":"P13*Data!B29/100","v":169288116.5980576},{"$f":"Q13-N13","v":121618536.5980576},{"$f":"P13-Q13","v":34428032.266586602},{"$f":"S13/P13","v":0.16900001525878899},null,{"$f":"B13","v":105.6},{"$f":"V13*$W$2*Data!$B$3*Data!$B$4","v":993300},{"$f":"S13-W13","v":33434732.266586602},{"$f":"X13/P13","v":0.16412411314923175},null,{"$f":"R13*$AA$2","v":60809268.299028799},{"$f":"R13-AA13","v":60809268.299028799},{"$f":"AB13/P13*100","v":29.849998950958227},null,{"$f":"100-AC13","v":70.150001049041776},{"$f":"W13/(1-AE13/100)","v":3327638.3079005564},{"$f":"AF13/P13*100","v":1.6334681008090088},null,100,{"$f":"AI13*R13/P13","v":59.699997901916454},{"$f":"$AA$2*AJ13","v":29.849998950958227},{"$f":"AJ13-AK13","v":29.849998950958227},{"$f":"AI13*N13/P13","v":23.40000057220464},{"$f":"AI13-AK13-AL13-AM13","v":16.900001525878913},null,{"$f":"W13/N13*100","v":2.0837187992845752},null,{"$f":"AS13*AT13","v":100},{"$f":"$AX$5","v":1},{"$f":"100*$AX$6","v":100},{"$f":"AW13+AX13","v":59.699997901916454},{"$f":"AL13/AI13*$AX$8","v":0.29849998950958229},{"$f":"AK13*$AX$7","v":29.849998950958227},{"$f":"AV13*AT13","v":29.849998950958227},{"$f":"AM13*(1+AP13/100)","v":23.887590783160366},{"$f":"AR13-AW13-AX13-AY13","v":16.412411314923187},null,null,null,"No LW",{"$f":"INDEX(AI13:AI26,$BG$6)","v":100},{"$f":"INDEX(AK13:AK26,$BG$6)","v":29.849999666214007},{"$f":"INDEX(AL13:AL26,$BG$6)","v":29.849999666214007},{"$f":"INDEX(AM13:AM26,$BG$6)","v":25.399999141693073},{"$f":"INDEX(AN13:AN26,$BG$6)","v":14.90000152587892}]
[{"$f":"Data!A9","v":"Food & Beverages"},{"$f":"Data!$C9*Data!E9/100","v":535.13499999999999},{"$f":"Data!$C9*Data!F9/100","v":88.424999999999997},{"$f":"Data!$C9*Data!G9/100","v":13.755000000000001},{"$f":"Data!$C9*Data!H9/100","v":12.445},{"$f":"Data!$C9*Data!I9/100","v":4.5849999999999991},{"$f":"Data!$C9*Data!J9/100","v":654.34500000000003},null,{"$f":"B14*Data!E$4*Data!$B$3*Data!$B$4","v":11823138.90625},{"$f":"C14*Data!F$4*Data!$B$3*Data!$B$4","v":2785387.4999999995},{"$f":"D14*Data!G$4*Data!$B$3*Data!$B$4","v":553638.75},{"$f":"E14*Data!H$4*Data!$B$3*Data!$B$4","v":609805.00000000012},{"$f":"F14*Data!I$4*Data!$B$3*Data!$B$4","v":320949.99999999994},{"$f":"SUM(I14:M14)","v":16092920.15625},null,{"$f":"N14/Data!G30*100","v":52591240.865541622},{"$f":"P14*Data!B30/100","v":51171278.967129298},{"$f":"Q14-N14","v":35078358.810879298},1419961.8984123245,2.6999969482421924E-2,null,535.13499999999999,{"$f":"V14*$W$2*Data!$B$3*Data!$B$4","v":5033613.59375},{"$f":"S14-W14","v":-3613651.6953376755},-6.8712044740997569E-2,null,17539179.405439649,17539179.405439649,33.350001096725443,null,{"$f":"100-AC14","v":66.649998903274565},{"$f":"W14/(1-AE14/100)","v":15093293.637835111},28.69925369592184,null,100,66.700002193450885,33.350001096725443,{"$f":"AJ14-AK14","v":33.350001096725443},30.600000858306927,{"$f":"AI14-AK14-AL14-AM14","v":2.6999969482421946},null,31.278435143388801,null,{"$f":"AS14*AT14","v":100},{"$f":"$AX$5","v":1},{"$f":"100*$AX$6","v":100},{"$f":"AW14+AX14","v":66.700002193450885},{"$f":"AL14/AI14*$AX$8","v":0.3335000109672544},{"$f":"AK14*$AX$7","v":33.350001096725443},{"$f":"AV14*AT14","v":33.350001096725443},{"$f":"AM14*(1+AP14/100)","v":40.171202280648878},{"$f":"AR14-AW14-AX14-AY14","v":-6.8712044740997555},null,null,null,"With LW",{"$f":"INDEX(AR13:AR26,$BG$6)","v":100},{"$f":"INDEX(AW13:AW26,$BG$6)","v":29.849999666214007},{"$f":"INDEX(AX13:AX26,$BG$6)","v":29.849999666214007},28.016409775220978,12.283590892351015]
[{"$f":"Data!A10","v":"Tourism"},{"$f":"Data!$C10*Data!E10/100","v":216.6},{"$f":"Data!$C10*Data!F10/100","v":150.47999999999999},{"$f":"Data!$C10*Data!G10/100","v":105.45},{"$f":"Data!$C10*Data!H10/100","v":38.76},{"$f":"Data!$C10*Data!I10/100","v":58.71},{"$f":"Data!$C10*Data!J10/100","v":570},null,{"$f":"B15*Data!E$4*Data!$B$3*Data!$B$4","v":4785506.25},{"$f":"C15*Data!F$4*Data!$B$3*Data!$B$4","v":4740120},{"$f":"D15*Data!G$4*Data!$B$3*Data!$B$4","v":4244362.5},{"$f":"E15*Data!H$4*Data!$B$3*Data!$B$4","v":1899239.9999999998},{"$f":"F15*Data!I$4*Data!$B$3*Data!$B$4","v":4109700},19778928.75,null,{"$f":"N15/Data!G31*100","v":77869800.859692499},{"$f":"P15*Data!B31/100","v":66267199.34339945},46488270.59339945,11602601.516293049,0.14900001525878909,null,216.6,{"$f":"V15*$W$2*Data!$B$3*Data!$B$4","v":2037393.75},9565207.7662930489,0.12283590892351,null,23244135.296699725,23244135.296699725,29.849999666214011,null,70.150000333785982,6825439.7748152791,8.7651948502006647,null,100,59.699999332428014,29.849999666214007,29.849999666214007,25.399999141693073,14.90000152587892,null,10.300829613939531,null,100,1,100,59.699999332428014,0.29849999666214005,29.849999666214007,29.849999666214007,28.016409775220978,12.283590892351015]
[{"$f":"Data!A11","v":"Prof, Law & Government"},{"$f":"Data!$C11*Data!E11/100","v":10.81},{"$f":"Data!$C11*Data!F11/100","v":9.4},{"$f":"Data!$C11*Data!G11/100","v":163.55999999999997},{"$f":"Data!$C11*Data!H11/100","v":133.94999999999999},{"$f":"Data!$C11*Data!I11/100","v":152.75},{"$f":"Data!$C11*Data!J11/100","v":470.47},null,{"$f":"B16*Data!E$4*Data!$B$3*Data!$B$4","v":238833.4375},{"$f":"C16*Data!F$4*Data!$B$3*Data!$B$4","v":296100.00000000006},{"$f":"D16*Data!G$4*Data!$B$3*Data!$B$4","v":6583289.9999999981},{"$f":"E16*Data!H$4*Data!$B$3*Data!$B$4","v":6563549.9999999981},{"$f":"F16*Data!I$4*Data!$B$3*Data!$B$4","v":10692500},24374273.437499996,null,{"$f":"N16/Data!G32*100","v":79395025.510631874},{"$f":"P16*Data!B32/100","v":55417730.229364932},31043456.791864935,23977295.281266943,0.30199996948242203,null,10.81,{"$f":"V16*$W$2*Data!$B$3*Data!$B$4","v":101681.5625},23875613.718766943,0.30071926503216168,null,15521728.395932468,15521728.395932468,19.550001144409148,null,80.449998855590849,520110.26367166534,0.65509175206703196,null,100,39.100002288818295,19.550001144409148,19.550001144409148,30.700000762939499,30.199996948242198,null,0.41716756300748714,null,100,1,100,39.100002288818295,0.19550001144409149,19.550001144409148,19.550001144409148,30.828071207965536,30.071926503216162]
[{"$f":"Data!A12","v":"Health and Social Services"},{"$f":"Data!$C12*Data!E12/100","v":40.5},{"$f":"Data!$C12*Data!F12/100","v":84.15},{"$f":"Data!$C12*Data!G12/100","v":162},{"$f":"Data!$C12*Data!H12/100","v":49.95},{"$f":"Data!$C12*Data!I12/100","v":113.85},{"$f":"Data!$C12*Data!J12/100","v":450.45},null,{"$f":"B17*Data!E$4*Data!$B$3*Data!$B$4","v":894796.875},{"$f":"C17*Data!F$4*Data!$B$3*Data!$B$4","v":2650725},{"$f":"D17*Data!G$4*Data!$B$3*Data!$B$4","v":6520500},{"$f":"E17*Data!H$4*Data!$B$3*Data!$B$4","v":2447550.0000000005},{"$f":"F17*Data!I$4*Data!$B$3*Data!$B$4","v":7969500},20483071.875,null,{"$f":"N17/Data!G33*100","v":60961523.610528097},{"$f":"P17*Data!B33/100","v":39320182.728790618},18837110.853790618,21641340.881737478,0.35500000000000004,null,40.5,{"$f":"V17*$W$2*Data!$B$3*Data!$B$4","v":380953.125},21260387.756737478,0.34875092513379691,null,9418555.4268953092,9418555.4268953092,15.450000047683712,null,84.549999952316284,2465716.0118074748,4.0447086387808788,null,100,30.900000095367428,15.450000047683714,15.450000047683714,33.599999904632568,35.5,null,1.8598437154583289,null,100,1,100,30.900000095367432,0.15450000047683715,15.450000047683714,15.450000047683716,34.224907391252884,34.875092513379684]
[{"$f":"Data!A13","v":"Transport"},{"$f":"Data!$C13*Data!E13/100","v":15.54},{"$f":"Data!$C13*Data!F13/100","v":4.620000000000001},{"$f":"Data!$C13*Data!G13/100","v":12.6},{"$f":"Data!$C13*Data!H13/100","v":112.14},{"$f":"Data!$C13*Data!I13/100","v":275.52},{"$f":"Data!$C13*Data!J13/100","v":420.42},null,{"$f":"B18*Data!E$4*Data!$B$3*Data!$B$4","v":343336.875},{"$f":"C18*Data!F$4*Data!$B$3*Data!$B$4","v":145530.00000000003},{"$f":"D18*Data!G$4*Data!$B$3*Data!$B$4","v":507150},{"$f":"E18*Data!H$4*Data!$B$3*Data!$B$4","v":5494860},{"$f":"F18*Data!I$4*Data!$B$3*Data!$B$4","v":19286400},25777276.875,null,{"$f":"N18/Data!G34*100","v":125132412.59386197},{"$f":"P18*Data!B34/100","v":107113343.27097675},81336066.395976752,18019069.322885215,0.14400001525878908,null,15.54,{"$f":"V18*$W$2*Data!$B$3*Data!$B$4","v":146173.12499999997},17872896.197885215,0.14283186767839814,null,40668033.197988376,40668033.197988376,32.499999284744256,null,67.500000715255737,449763.47143679694,0.35943003264596118,null,100,64.999998569488525,32.499999284744263,32.499999284744263,20.599999904632572,14.400001525878903,null,0.56706193485381484,null,100,1,100,64.999998569488525,0.32499999284744263,32.499999284744263,32.499999284744263,20.716814662671663,14.283186767839812]
[{"$f":"Data!A14","v":"Retail"},{"$f":"Data!$C14*Data!E14/100","v":196.18},{"$f":"Data!$C14*Data!F14/100","v":44.88},{"$f":"Data!$C14*Data!G14/100","v":26.18},{"$f":"Data!$C14*Data!H14/100","v":43.18},{"$f":"Data!$C14*Data!I14/100","v":29.24},{"$f":"Data!$C14*Data!J14/100","v":339.66},null,{"$f":"B19*Data!E$4*Data!$B$3*Data!$B$4","v":4334351.875},{"$f":"C19*Data!F$4*Data!$B$3*Data!$B$4","v":1413720},{"$f":"D19*Data!G$4*Data!$B$3*Data!$B$4","v":1053745},{"$f":"E19*Data!H$4*Data!$B$3*Data!$B$4","v":2115820},{"$f":"F19*Data!I$4*Data!$B$3*Data!$B$4","v":2046800},10964436.875,null,{"$f":"N19/Data!G35*100","v":68958724.138721004},{"$f":"P19*Data!B35/100","v":65717666.208654359},54753229.333654359,3241057.9300666451,4.6999969482422008E-2,null,196.18,{"$f":"V19*$W$2*Data!$B$3*Data!$B$4","v":1845318.1249999998},1395739.8050666454,2.024022083498676E-2,null,27376614.666827179,27376614.666827179,39.700001716613755,null,60.299998283386245,4648156.285161485,6.740490551726289,null,100,79.400003433227496,39.700001716613748,39.700001716613748,15.899999618530298,4.6999969482422053,null,16.830030999654049,null,100,1,100,79.400003433227496,0.39700001716613748,39.700001716613748,39.700001716613748,18.575974483273825,2.0240220834986786,null,null,null,"LW","Total ","Total","Total","Revenue","Profit"]
[{"$f":"Data!A15","v":"Accommodation"},{"$f":"Data!$C15*Data!E15/100","v":170.51},{"$f":"Data!$C15*Data!F15/100","v":90.27},{"$f":"Data!$C15*Data!G15/100","v":28.024999999999999},{"$f":"Data!$C15*Data!H15/100","v":0},{"$f":"Data!$C15*Data!I15/100","v":6.1950000000000003},{"$f":"Data!$C15*Data!J15/100","v":295},null,{"$f":"B20*Data!E$4*Data!$B$3*Data!$B$4","v":3767205.3125},{"$f":"C20*Data!F$4*Data!$B$3*Data!$B$4","v":2843505},{"$f":"D20*Data!G$4*Data!$B$3*Data!$B$4","v":1128006.2499999998},{"$f":"E20*Data!H$4*Data!$B$3*Data!$B$4","v":0},{"$f":"F20*Data!I$4*Data!$B$3*Data!$B$4","v":433650},8172366.5625,null,{"$f":"N20/Data!G36*100","v":32559230.07492191},{"$f":"P20*Data!B36/100","v":29856812.98507455},21684446.42257455,2702417.0898473598,8.3000030517577941E-2,null,170.51,{"$f":"V20*$W$2*Data!$B$3*Data!$B$4","v":1603859.6875},1098557.4023473598,3.3740275793361023E-2,null,10842223.211287275,10842223.211287275,33.299998760223382,null,66.700001239776611,4816395.6372749144,14.792719687142252,null,100,66.599997520446763,33.299998760223382,33.299998760223382,25.099999427795439,8.3000030517577912,null,19.625400735932789,null,100,1,100,66.599997520446763,0.33299998760223382,33.299998760223382,33.299998760223382,30.025974900217133,3.3740275793360972,null,null,null,"Increment","Inc. Cost","Revenue","Profit","Share","Share"]
{"$rows_left_out":110}
{"sheet":"Data","index":3,"n_rows":89,"n_cols":10,"rows_kept":89,"cut":false,"hidden":false,"merged":[]}
["Revelstoke Labour Market Impacts Model",null,null,null,"Wage Categories (Top category guess)"]
["Total employment",5000,null,"Bottom",10.25,16,21,26,30]
["Weekly hours worked",35,null,"Top",15,20,25,30,50]
["Weeks per year worked",50,null,"Midpoint",{"$f":"AVERAGE(E2:E3)","v":12.625},{"$f":"AVERAGE(F2:F3)","v":18},{"$f":"AVERAGE(G2:G3)","v":23},{"$f":"AVERAGE(H2:H3)","v":28},{"$f":"AVERAGE(I2:I3)","v":40}]
[]
["","Labour",null,null,"Sector employment by wage category."]
["Sectors","Share","Employment",null,{"$f":"CONCATENATE(\"$\",FIXED(E2,2),\"-\",FIXED(E3,2))","v":"$10.25-15.00"},{"$f":"CONCATENATE(\"$\",FIXED(F2,2),\"-\",FIXED(F3,2))","v":"$16.00-20.00"},{"$f":"CONCATENATE(\"$\",FIXED(G2,2),\"-\",FIXED(G3,2))","v":"$21.00-25.00"},{"$f":"CONCATENATE(\"$\",FIXED(H2,2),\"-\",FIXED(H3,2))","v":"$26.00-30.00"},{"$f":"CONCATENATE(\"$\",FIXED(I2,2),\"-\",FIXED(I3,2))","v":"$30.00-50.00"},"Total"]
["Forestry",19.2,960,null,11,24.3,12.8,9.1,42.8,{"$f":"SUM(E8:I8)","v":100}]
["Food & Beverages",13.1,655,null,81.7,13.5,2.1,1.9,0.7,99.9]
["Tourism",11.4,570,null,38,26.4,18.5,6.8,10.3,100]
["Prof, Law & Government",9.4,470,null,2.2999999999999998,2,34.799999999999997,28.5,32.5,100.1]
["Health and Social Services",9,450,null,9,18.7,36,11.1,25.3,100.1]
["Transport",8.4,420,null,3.7,1.1000000000000001,3,26.7,65.599999999999994,100.1]
["Retail",6.8,340,null,57.7,13.2,7.7,12.7,8.6,99.9]
["Accommodation",5.9,295,null,57.8,30.6,9.5,0,2.1,100]
["Construction",4.4000000000000004,220,null,3.6,12.1,27.1,31.4,25.7,99.899999999999991]
["Education",3.9,195,null,0,2.4,31.5,0.8,65.400000000000006,100.1]
["Business Services",3.5,175,null,25.7,8.8000000000000007,10.6,9.6999999999999993,45.1,99.9]
["Utilities",2.6,130,null,0,13.1,3.6,7.1,76.2,100]
["Auto & Mechanical",1.3,65,null,16.3,20.9,25.6,23.3,14,100.10000000000001]
{"$rows_left_out":69}